Whenever I try generating a singed app or try running the built app on my device it shows error :-
Error:Execution failed for task ':app:transformClassesWithDexForDebug'.
> com.android.ide.common.process.ProcessException: org.gradle.process.internal.ExecException: Process 'command 'C:\Program Files\Java\jdk1.7.0_45\bin\java.exe'' finished with non-zero exit value 1
Can anyone tell me what can be the reason and how can i resolve this!!
(Gradle build failure)
I have already referred to many other sites but I think XDA developers is the best place to discuss this.....
Please reply ASAP!
Thanks :)
Error:Execution failed for task ':app:transformClassesWithDexForDebug'.
> com.android.ide.common.process.ProcessException: org.gradle.process.internal.ExecException: Process 'command 'C:\Program Files\Java\jdk1.7.0_45\bin\java.exe'' finished with non-zero exit value 1
Can anyone tell me what can be the reason and how can i resolve this!!
(Gradle build failure)
I have already referred to many other sites but I think XDA developers is the best place to discuss this.....
Please reply ASAP!
Thanks :)
No comments:
Post a Comment